beggarly-a
type: LexicalEntry
canonical form: beggarly
sense: 01116711-s
part of speech: adjective
sense: 02033096-s

mean-a
type: LexicalEntry
canonical form: mean
sense: 01116711-s
part of speech: adjective
sense: 02033096-s

01116711-s
type: LexicalConcept
in scheme: en-word.net
definition: (used of sums of money) so small in amount as to deserve contempt
ili: i6108
lexfile: adj.all
part of speech: adjective satellite
similar: https://en-word.net/synset/01116284-a

02033096-s
type: LexicalConcept
in scheme: en-word.net
definition: marked by poverty befitting a beggar
example: a beggarly existence in the slums
example: a mean hut
ili: i11096
lexfile: adj.all
part of speech: adjective satellite
similar: https://en-word.net/synset/02032876-a