carrier-n
type: LexicalEntry
canonical form: carrier
sense: 09917148-n
part of speech: noun

bearer-n
type: LexicalEntry
canonical form: bearer
sense: 09917148-n
part of speech: noun
sense: 10199542-n
sense: 10330910-n
sense: 10414772-n

toter-n
type: LexicalEntry
canonical form: toter
sense: 09917148-n
part of speech: noun

09917148-n
type: LexicalConcept
in scheme: en-word.net
definition: someone whose employment involves carrying something
example: the bonds were transmitted by carrier
ili: i88844
lexfile: noun.person
part of speech: noun
hypernym: 09652940-n

holder-n
type: LexicalEntry
canonical form: holder
sense: 10199542-n
part of speech: noun

10199542-n
type: LexicalConcept
in scheme: en-word.net
definition: the person who is in possession of a check or note or bond or document of title that is endorsed to them or to whoever holds it
example: the bond was marked ‘payable to bearer’
ili: i90534
lexfile: noun.person
part of speech: noun
hypernym: 09632262-n

10330910-n
type: LexicalConcept
in scheme: en-word.net
definition: a messenger who bears or presents
example: a bearer of good tidings
ili: i91323
lexfile: noun.person
part of speech: noun
hypernym: 10330688-n

pallbearer-n
type: LexicalEntry
canonical form: pallbearer
sense: 10414772-n
part of speech: noun

10414772-n
type: LexicalConcept
in scheme: en-word.net
definition: one of the mourners carrying the coffin at a funeral
ili: i91830
lexfile: noun.person
part of speech: noun
hypernym: 10354959-n