banana-n
type: LexicalEntry
canonical form: banana
sense: 07769568-n
part of speech: noun
sense: 12372804-n

07769568-n
type: LexicalConcept
in scheme: en-word.net
definition: elongated crescent-shaped yellow fruit with soft sweet flesh
ili: i77804
lexfile: noun.food
part of speech: noun
hypernym: 07721676-n

banana tree-n
type: LexicalEntry
canonical form: banana tree
sense: 12372804-n
part of speech: noun

12372804-n
type: LexicalConcept
in scheme: en-word.net
definition: any of several tropical and subtropical treelike herbs of the genus Musa having a terminal crown of large entire leaves and usually bearing hanging clusters of elongated fruits
ili: i101947
lexfile: noun.plant
part of speech: noun
hypernym: 12226211-n