badge-v
type: LexicalEntry
canonical form: badge
sense: 01592790-v
part of speech: verb

01592790-v
type: LexicalConcept
in scheme: en-word.net
definition: put a badge on
example: The workers here must be badged
ili: i29679
lexfile: verb.contact
part of speech: verb
hypernym: 01591414-v

badge-n
type: LexicalEntry
canonical form: badge
sense: 05859658-n
part of speech: noun
sense: 06895611-n

05859658-n
type: LexicalConcept
in scheme: en-word.net
definition: any feature that is regarded as a sign of status (a particular power or quality or rank)
example: wearing a tie was regarded as a badge of respectability
ili: i67619
lexfile: noun.cognition
part of speech: noun
hypernym: 05858316-n

06895611-n
type: LexicalConcept
in scheme: en-word.net
definition: an emblem (a small piece of plastic or cloth or metal) that signifies your status (rank or membership or affiliation etc.)
example: they checked everyone's badge before letting them in
ili: i72668
lexfile: noun.communication
part of speech: noun
hypernym: 06893714-n