armorer-n
type: LexicalEntry
canonical form: armorer
sense: 09828217-n
part of speech: noun

armourer-n
type: LexicalEntry
canonical form: armourer
sense: 09828217-n
part of speech: noun

artificer-n
type: LexicalEntry
canonical form: artificer
sense: 09828217-n
part of speech: noun
sense: 09994178-n
sense: 10234307-n

09828217-n
type: LexicalConcept
in scheme: en-word.net
definition: an enlisted man responsible for the upkeep of small arms and machine guns etc.
ili: i88294
lexfile: noun.person
part of speech: noun
hypernym: 10078393-n

artisan-n
type: LexicalEntry
canonical form: artisan
sense: 09994178-n
part of speech: noun

09994178-n
type: LexicalConcept
in scheme: en-word.net
definition: a skilled worker who practices some trade or handicraft
ili: i89293
lexfile: noun.person
part of speech: noun
hypernym: 10625393-n

inventor-n
type: LexicalEntry
canonical form: inventor
sense: 10234307-n
part of speech: noun

discoverer-n
type: LexicalEntry
canonical form: discoverer
sense: 10234307-n
part of speech: noun

10234307-n
type: LexicalConcept
in scheme: en-word.net
definition: someone who is the first to think of or make something
ili: i90743
lexfile: noun.person
part of speech: noun
hypernym: 09637345-n