arousal-n
type: LexicalEntry
canonical form: arousal
sense: 00243675-n
part of speech: noun
sense: 00855465-n
sense: 05686586-n
sense: 14047468-n

rousing-n
type: LexicalEntry
canonical form: rousing
sense: 00243675-n
part of speech: noun

00243675-n
type: LexicalConcept
in scheme: en-word.net
definition: the act of arousing
example: the purpose of art is the arousal of emotions
ili: i36676
lexfile: noun.act
part of speech: noun
hypernym: 00199979-n

foreplay-n
type: LexicalEntry
canonical form: foreplay
sense: 00855465-n
part of speech: noun

stimulation-n
type: LexicalEntry
canonical form: stimulation
sense: 00855465-n
part of speech: noun

00855465-n
type: LexicalConcept
in scheme: en-word.net
definition: mutual sexual fondling prior to sexual intercourse
ili: i39883
lexfile: noun.act
part of speech: noun
hypernym: 00845915-n

05686586-n
type: LexicalConcept
in scheme: en-word.net
definition: awakening from sleep
ili: i66758
lexfile: noun.cognition
part of speech: noun
hypernym: 05686315-n

14047468-n
type: LexicalConcept
in scheme: en-word.net
definition: a state of heightened physiological activity
ili: i110633
lexfile: noun.state
part of speech: noun
hypernym: 14057659-n