armchair-n
type: LexicalEntry
canonical form: armchair
sense: 02741540-n
part of speech: noun

02741540-n
type: LexicalConcept
in scheme: en-word.net
definition: chair with a support on each side for arms
ili: i50150
lexfile: noun.artifact
part of speech: noun
hypernym: 03005231-n
mero part: 02740665-n