applicant-n
type: LexicalEntry
canonical form: applicant
sense: 09630310-n
part of speech: noun

applier-n
type: LexicalEntry
canonical form: applier
sense: 09630310-n
part of speech: noun

09630310-n
type: LexicalConcept
in scheme: en-word.net
definition: a person who requests or seeks something such as assistance or employment or admission
ili: i87159
lexfile: noun.person
part of speech: noun
hypernym: 09786620-n