apartment-n
type: LexicalEntry
canonical form: apartment
sense: 02729230-n
part of speech: noun

flat-n
type: LexicalEntry
canonical form: flat
sense: 02729230-n
part of speech: noun

02729230-n
type: LexicalConcept
in scheme: en-word.net
definition: a suite of rooms usually on one floor of an apartment house
ili: i50088
lexfile: noun.artifact
part of speech: noun
hypernym: 03551520-n
mero part: 03625562-n