anorectic-a
type: LexicalEntry
canonical form: anorectic
sense: 00323945-s
part of speech: adjective
sense: 00992003-s

anorexigenic-a
type: LexicalEntry
canonical form: anorexigenic
sense: 00323945-s
part of speech: adjective

00323945-s
type: LexicalConcept
in scheme: en-word.net
definition: causing loss of appetite
example: an anorectic (or anorexigenic) drug
ili: i1795
lexfile: adj.all
part of speech: adjective satellite
similar: https://en-word.net/synset/00323355-a

anorexic-a
type: LexicalEntry
canonical form: anorexic
sense: 00992003-s
part of speech: adjective

00992003-s
type: LexicalConcept
in scheme: en-word.net
definition: suffering from anorexia nervosa; pathologically thin
ili: i5411
lexfile: adj.all
part of speech: adjective satellite
similar: https://en-word.net/synset/00991420-a

anorexic-n
type: LexicalEntry
canonical form: anorexic
sense: 09815192-n
part of speech: noun

anorectic-n
type: LexicalEntry
canonical form: anorectic
sense: 09815192-n
part of speech: noun

09815192-n
type: LexicalConcept
in scheme: en-word.net
definition: a person suffering from anorexia nervosa
ili: i88230
lexfile: noun.person
part of speech: noun
hypernym: 10615055-n