angle bracket-n
type: LexicalEntry
canonical form: angle bracket
sense: 02715404-n
part of speech: noun
sense: 06855502-n

angle iron-n
type: LexicalEntry
canonical form: angle iron
sense: 02715404-n
part of speech: noun

02715404-n
type: LexicalConcept
in scheme: en-word.net
definition: an L-shaped metal bracket
ili: i50022
lexfile: noun.artifact
part of speech: noun
hypernym: 02891810-n

bracket-n
type: LexicalEntry
canonical form: bracket
sense: 06855502-n
part of speech: noun

06855502-n
type: LexicalConcept
in scheme: en-word.net
definition: either of two punctuation marks (‘<’ or ‘>’) used in computer programming and sometimes used to enclose textual material
ili: i72477
lexfile: noun.communication
part of speech: noun
hypernym: 06854415-n