anecdote-n
type: LexicalEntry
canonical form: anecdote
sense: 07235246-n
part of speech: noun

07235246-n
type: LexicalConcept
in scheme: en-word.net
definition: short account of an incident (especially a biographical one)
ili: i74606
lexfile: noun.communication
part of speech: noun
hypernym: 07232584-n