analysis-n
type: LexicalEntry
canonical form: analysis
sense: 05780664-n
part of speech: noun

analytic thinking-n
type: LexicalEntry
canonical form: analytic thinking
sense: 05780664-n
part of speech: noun

05780664-n
type: LexicalConcept
in scheme: en-word.net
definition: the abstract separation of a whole into its constituent parts in order to study the parts and their relations
ili: i67227
lexfile: noun.cognition
part of speech: noun
hypernym: 05780353-n