ana-n
type: LexicalEntry
canonical form: ana
sense: 08479975-n
part of speech: noun

08479975-n
type: LexicalConcept
in scheme: en-word.net
definition: a collection of anecdotes about a person or place
ili: i81529
lexfile: noun.group
part of speech: noun
hypernym: 07968050-n