ampere-n
type: LexicalEntry
canonical form: ampere
sense: 13658855-n
part of speech: noun
sense: 13659320-n

amp-n
type: LexicalEntry
canonical form: amp
sense: 13658855-n
part of speech: noun

A-n
type: LexicalEntry
canonical form: A
sense: 13658855-n
part of speech: noun

13658855-n
type: LexicalConcept
in scheme: en-word.net
definition: the basic unit of electric current adopted under the Systeme International d'Unites
example: a typical household circuit carries 15 to 50 amps
ili: i108363
lexfile: noun.quantity
part of speech: noun
hypernym: 13654836-n
mero part: 13659092-n

international ampere-n
type: LexicalEntry
canonical form: international ampere
sense: 13659320-n
part of speech: noun

13659320-n
type: LexicalConcept
in scheme: en-word.net
definition: a former unit of electric current (slightly smaller than the SI ampere)
ili: i108366
lexfile: noun.quantity
part of speech: noun
hypernym: 13654836-n