amerce-v
type: LexicalEntry
canonical form: amerce
sense: 02504636-v
part of speech: verb
sense: 02505914-v

02504636-v
type: LexicalConcept
in scheme: en-word.net
definition: punish by a fine imposed arbitrarily by the discretion of the court
ili: i34213
lexfile: verb.social
part of speech: verb
hypernym: 02504365-v
similar: 02505914-v

02505914-v
type: LexicalConcept
in scheme: en-word.net
definition: punish with an arbitrary penalty
ili: i34218
lexfile: verb.social
part of speech: verb
hypernym: 02505278-v
similar: 02504636-v