ambergris-n
type: LexicalEntry
canonical form: ambergris
sense: 14725146-n
part of speech: noun

14725146-n
type: LexicalConcept
in scheme: en-word.net
definition: waxy substance secreted by the sperm whale and found floating at sea or washed ashore; used in perfume
ili: i114247
lexfile: noun.substance
part of speech: noun
hypernym: 14724906-n