altimeter-n
type: LexicalEntry
canonical form: altimeter
sense: 02703117-n
part of speech: noun

02703117-n
type: LexicalConcept
in scheme: en-word.net
definition: an instrument that measures the height above ground; used in navigation
ili: i49952
lexfile: noun.artifact
part of speech: noun
hypernym: 03739416-n
mero part: 02713459-n