allegory-n
type: LexicalEntry
canonical form: allegory
sense: 06378026-n
part of speech: noun
sense: 06383718-n
sense: 06893714-n

06378026-n
type: LexicalConcept
in scheme: en-word.net
definition: an expressive style that uses fictional characters and events to describe some subject by suggestive resemblances; an extended metaphor
ili: i69933
lexfile: noun.communication
part of speech: noun
hypernym: 07080699-n

fable-n
type: LexicalEntry
canonical form: fable
sense: 06383718-n
part of speech: noun

parable-n
type: LexicalEntry
canonical form: parable
sense: 06383718-n
part of speech: noun

apologue-n
type: LexicalEntry
canonical form: apologue
sense: 06383718-n
part of speech: noun

06383718-n
type: LexicalConcept
in scheme: en-word.net
definition: a short moral story (often with animal characters)
ili: i69963
lexfile: noun.communication
part of speech: noun
hypernym: 06381452-n

emblem-n
type: LexicalEntry
canonical form: emblem
sense: 06893714-n
part of speech: noun

06893714-n
type: LexicalConcept
in scheme: en-word.net
definition: a visible symbol representing an abstract idea
ili: i72657
lexfile: noun.communication
part of speech: noun
hypernym: 05773412-n