alizarin-n
type: LexicalEntry
canonical form: alizarin
sense: 15010836-n
part of speech: noun

alizarine-n
type: LexicalEntry
canonical form: alizarine
sense: 15010836-n
part of speech: noun

15010836-n
type: LexicalConcept
in scheme: en-word.net
definition: an orange-red crystalline compound used in making red pigments and in dyeing
ili: i115898
lexfile: noun.substance
part of speech: noun
hypernym: 15014387-n