alimony-n
type: LexicalEntry
canonical form: alimony
sense: 13304643-n
part of speech: noun

maintenance-n
type: LexicalEntry
canonical form: maintenance
sense: 13304643-n
part of speech: noun

13304643-n
type: LexicalConcept
in scheme: en-word.net
definition: court-ordered support paid by one spouse to another after they are separated
ili: i106472
lexfile: noun.possession
part of speech: noun
hypernym: 13304337-n