adjutant-n
type: LexicalEntry
canonical form: adjutant
sense: 09789602-n
part of speech: noun

aide-n
type: LexicalEntry
canonical form: aide
sense: 09789602-n
part of speech: noun
sense: 09799690-n

aide-de-camp-n
type: LexicalEntry
canonical form: aide-de-camp
sense: 09789602-n
part of speech: noun

09789602-n
type: LexicalConcept
in scheme: en-word.net
definition: an officer who acts as military assistant to a more senior officer
ili: i88080
lexfile: noun.person
part of speech: noun
domain topic: 08215965-n
hypernym: 10336665-n

auxiliary-n
type: LexicalEntry
canonical form: auxiliary
sense: 09799690-n
part of speech: noun

09799690-n
type: LexicalConcept
in scheme: en-word.net
definition: someone who acts as assistant
ili: i88130
lexfile: noun.person
part of speech: noun
hypernym: 09835195-n