farming-n
type: LexicalEntry
canonical form: farming
sense: 00918295-n
part of speech: noun

agriculture-n
type: LexicalEntry
canonical form: agriculture
sense: 00918295-n
part of speech: noun
sense: 01106311-n
sense: 08092123-n

husbandry-n
type: LexicalEntry
canonical form: husbandry
sense: 00918295-n
part of speech: noun

00918295-n
type: LexicalConcept
in scheme: en-word.net
definition: the practice of cultivating the land or raising stock
ili: i40225
lexfile: noun.act
part of speech: noun
hypernym: 00917553-n
mero part: 00920634-n
mero part: 00923604-n

agribusiness-n
type: LexicalEntry
canonical form: agribusiness
sense: 01106311-n
part of speech: noun

factory farm-n
type: LexicalEntry
canonical form: factory farm
sense: 01106311-n
part of speech: noun

01106311-n
type: LexicalConcept
in scheme: en-word.net
definition: a large-scale farming enterprise
ili: i41187
lexfile: noun.act
part of speech: noun
hypernym: 01096649-n

08092123-n
type: LexicalConcept
in scheme: en-word.net
definition: the class of people engaged in growing food
ili: i79654
lexfile: noun.group
part of speech: noun
hypernym: 07990472-n