woman-n
type: LexicalEntry
canonical form: woman
sense: 10807146-n
part of speech: noun

adult female-n
type: LexicalEntry
canonical form: adult female
sense: 10807146-n
part of speech: noun

10807146-n
type: LexicalConcept
in scheme: en-word.net
definition: an adult female person (as opposed to a man)
example: the woman kept house while the man hunted
ili: i94168
lexfile: noun.person
part of speech: noun
exemplifies: 06730109-n
hypernym: 09642198-n
hypernym: 09628463-n
mero part: 05227400-n