adoptee-n
type: LexicalEntry
canonical form: adoptee
sense: 09791753-n
part of speech: noun

09791753-n
type: LexicalConcept
in scheme: en-word.net
definition: someone (such as a child) who has been adopted
ili: i88090
lexfile: noun.person
part of speech: noun
hypernym: 09786620-n