Book of Zechariah-n
type: LexicalEntry
canonical form: Book of Zechariah
sense: 06452865-n
part of speech: noun

Zechariah-n
type: LexicalEntry
canonical form: Zechariah
sense: 06452865-n
part of speech: noun
sense: 11425315-n

Zacharias-n
type: LexicalEntry
canonical form: Zacharias
sense: 06452865-n
part of speech: noun
sense: 11425315-n

Book of Zachariah-n
type: LexicalEntry
canonical form: Book of Zachariah
sense: 06452865-n
part of speech: noun

06452865-n
type: LexicalConcept
in scheme: en-word.net
definition: an Old Testament book telling the prophecies of Zechariah which are concerned mainly with the renewal of Israel after the Babylonian Captivity
ili: i70333
lexfile: noun.communication
part of speech: noun
instance hypernym: 06406508-n

11425315-n
type: LexicalConcept
in scheme: en-word.net
definition: a Hebrew minor prophet of the late 6th century BC
ili: i97529
lexfile: noun.person
part of speech: noun
instance hypernym: 10503475-n