Wood-n
type: LexicalEntry
canonical form: Wood
sense: 11415461-n
part of speech: noun
sense: 11415604-n
sense: 11415768-n
sense: 11415890-n

Grant Wood-n
type: LexicalEntry
canonical form: Grant Wood
sense: 11415461-n
part of speech: noun

11415461-n
type: LexicalConcept
in scheme: en-word.net
definition: United States painter noted for works based on life in the Midwest (1892-1942)
ili: i97470
lexfile: noun.person
part of speech: noun
instance hypernym: 10411352-n

Ellen Wood-n
type: LexicalEntry
canonical form: Ellen Wood
sense: 11415604-n
part of speech: noun

Mrs. Henry Wood-n
type: LexicalEntry
canonical form: Mrs. Henry Wood
sense: 11415604-n
part of speech: noun

Ellen Price Wood-n
type: LexicalEntry
canonical form: Ellen Price Wood
sense: 11415604-n
part of speech: noun

11415604-n
type: LexicalConcept
in scheme: en-word.net
definition: English writer of novels about murders and thefts and forgeries (1814-1887)
ili: i97471
lexfile: noun.person
part of speech: noun
instance hypernym: 10813654-n

Sir Henry Wood-n
type: LexicalEntry
canonical form: Sir Henry Wood
sense: 11415768-n
part of speech: noun

Sir Henry Joseph Wood-n
type: LexicalEntry
canonical form: Sir Henry Joseph Wood
sense: 11415768-n
part of speech: noun

11415768-n
type: LexicalConcept
in scheme: en-word.net
definition: English conductor (1869-1944)
ili: i97472
lexfile: noun.person
part of speech: noun
instance hypernym: 09972018-n

Natalie Wood-n
type: LexicalEntry
canonical form: Natalie Wood
sense: 11415890-n
part of speech: noun

11415890-n
type: LexicalConcept
in scheme: en-word.net
definition: United States film actress (1938-1981)
ili: i97473
lexfile: noun.person
part of speech: noun
instance hypernym: 09787123-n