James-n
type: LexicalEntry
canonical form: James
sense: 11099382-n
part of speech: noun

William James-n
type: LexicalEntry
canonical form: William James
sense: 11099382-n
part of speech: noun

11099382-n
type: LexicalConcept
in scheme: en-word.net
definition: United States pragmatic philosopher and psychologist (1842-1910)
ili: i95693
lexfile: noun.person
part of speech: noun
instance hypernym: 10508450-n
instance hypernym: 10443334-n