Hogarth-n
type: LexicalEntry
canonical form: Hogarth
sense: 11075607-n
part of speech: noun

William Hogarth-n
type: LexicalEntry
canonical form: William Hogarth
sense: 11075607-n
part of speech: noun

11075607-n
type: LexicalConcept
in scheme: en-word.net
definition: English artist noted for a series of engravings that satirized the affectations of his time (1697-1764)
ili: i95560
lexfile: noun.person
part of speech: noun
instance hypernym: 10395493-n
instance hypernym: 10077963-n