Wiener-n
type: LexicalEntry
canonical form: Wiener
sense: 11405606-n
part of speech: noun

Norbert Wiener-n
type: LexicalEntry
canonical form: Norbert Wiener
sense: 11405606-n
part of speech: noun

11405606-n
type: LexicalConcept
in scheme: en-word.net
definition: United States mathematician and founder of cybernetics (1894-1964)
ili: i97415
lexfile: noun.person
part of speech: noun
instance hypernym: 10320928-n