Warji-n
type: LexicalEntry
canonical form: Warji
sense: 06995980-n
part of speech: noun

Warji language-n
type: LexicalEntry
canonical form: Warji language
sense: 06995980-n
part of speech: noun

06995980-n
type: LexicalConcept
in scheme: en-word.net
definition: a Chadic language spoken in northern Nigeria, especially in Bauchi State, Ningi LGA, and Jigawa State, Birnin Kudu LGA
ili: i73334
lexfile: noun.communication
part of speech: noun
hypernym: 06996181-n