Wagner-n
type: LexicalEntry
canonical form: Wagner
sense: 07293630-n
part of speech: noun
sense: 11389829-n
sense: 11390063-n

07293630-n
type: LexicalConcept
in scheme: en-word.net
definition: the music of Wagner
example: they say that Hitler listened only to Wagner
ili: i74942
lexfile: noun.communication
part of speech: noun
hypernym: 07034009-n

Richard Wagner-n
type: LexicalEntry
canonical form: Richard Wagner
sense: 11389829-n
part of speech: noun

Wilhelm Richard Wagner-n
type: LexicalEntry
canonical form: Wilhelm Richard Wagner
sense: 11389829-n
part of speech: noun

11389829-n
type: LexicalConcept
in scheme: en-word.net
definition: German composer of operas and inventor of the musical drama in which drama and spectacle and music are fused (1813-1883)
ili: i97321
lexfile: noun.person
part of speech: noun
instance hypernym: 09966711-n

Otto Wagner-n
type: LexicalEntry
canonical form: Otto Wagner
sense: 11390063-n
part of speech: noun

11390063-n
type: LexicalConcept
in scheme: en-word.net
definition: Austrian architect and pioneer of modern architecture (1841-1918)
ili: i97322
lexfile: noun.person
part of speech: noun
instance hypernym: 09824898-n