Vitus-n
type: LexicalEntry
canonical form: Vitus
sense: 11387720-n
part of speech: noun

St. Vitus-n
type: LexicalEntry
canonical form: St. Vitus
sense: 11387720-n
part of speech: noun

11387720-n
type: LexicalConcept
in scheme: en-word.net
definition: Christian martyr and patron of those who suffer from epilepsy and Sydenham's chorea (died around 300)
ili: i97309
lexfile: noun.person
part of speech: noun
instance hypernym: 10316493-n
instance hypernym: 10566702-n