University of Pittsburgh-n
type: LexicalEntry
canonical form: University of Pittsburgh
sense: 04519947-n
part of speech: noun

04519947-n
type: LexicalConcept
in scheme: en-word.net
definition: a university in Pittsburgh, Pennsylvania
ili: i60725
lexfile: noun.artifact
part of speech: noun
instance hypernym: 04518297-n