Trinidad-n
type: LexicalEntry
canonical form: Trinidad
sense: 08773685-n
part of speech: noun

08773685-n
type: LexicalConcept
in scheme: en-word.net
definition: an island in West Indies just off the northeastern coast of Venezuela
ili: i82898
lexfile: noun.location
part of speech: noun
instance hypernym: 09339360-n
mero part: 08774344-n