Trento-n
type: LexicalEntry
canonical form: Trento
sense: 08830404-n
part of speech: noun

Trent-n
type: LexicalEntry
canonical form: Trent
sense: 08830404-n
part of speech: noun
sense: 09484645-n

08830404-n
type: LexicalConcept
in scheme: en-word.net
definition: a city in northern Italy (northwest of Venice) on the River Adige; the site of the Council of Trent
ili: i83157
lexfile: noun.location
part of speech: noun
instance hypernym: 08542298-n

River Trent-n
type: LexicalEntry
canonical form: River Trent
sense: 09484645-n
part of speech: noun

Trent River-n
type: LexicalEntry
canonical form: Trent River
sense: 09484645-n
part of speech: noun

09484645-n
type: LexicalConcept
in scheme: en-word.net
definition: a river in central England that flows generally northeastward to join with the Ouse River and form the Humber
ili: i86339
lexfile: noun.object
part of speech: noun
instance hypernym: 09434308-n