Oates-n
type: LexicalEntry
canonical form: Oates
sense: 11231061-n
part of speech: noun

Titus Oates-n
type: LexicalEntry
canonical form: Titus Oates
sense: 11231061-n
part of speech: noun

11231061-n
type: LexicalConcept
in scheme: en-word.net
definition: English conspirator who claimed that there was a Jesuit plot to assassinate Charles II (1649-1705)
ili: i96429
lexfile: noun.person
part of speech: noun
exemplifies: 06730109-n
instance hypernym: 09978371-n