Epistle of Paul the Apostle to Titus-n
type: LexicalEntry
canonical form: Epistle of Paul the Apostle to Titus
sense: 06457659-n
part of speech: noun

Epistle to Titus-n
type: LexicalEntry
canonical form: Epistle to Titus
sense: 06457659-n
part of speech: noun

Titus-n
type: LexicalEntry
canonical form: Titus
sense: 06457659-n
part of speech: noun
sense: 11363842-n
sense: 11363993-n

06457659-n
type: LexicalConcept
in scheme: en-word.net
definition: a New Testament book containing Saint Paul's epistle to Titus; contains advice on pastoral matters
ili: i70352
lexfile: noun.communication
part of speech: noun
instance hypernym: 06454286-n

Titus Vespasianus Augustus-n
type: LexicalEntry
canonical form: Titus Vespasianus Augustus
sense: 11363842-n
part of speech: noun

Titus Flavius Vespasianus-n
type: LexicalEntry
canonical form: Titus Flavius Vespasianus
sense: 11363842-n
part of speech: noun

11363842-n
type: LexicalConcept
in scheme: en-word.net
definition: Emperor of Rome; son of Vespasian (39-81)
ili: i97172
lexfile: noun.person
part of speech: noun
instance hypernym: 10556797-n

Saint Titus-n
type: LexicalEntry
canonical form: Saint Titus
sense: 11363993-n
part of speech: noun

11363993-n
type: LexicalConcept
in scheme: en-word.net
definition: a Greek disciple and helper of Saint Paul
ili: i97173
lexfile: noun.person
part of speech: noun
instance hypernym: 09697405-n