Tabasco-n
type: LexicalEntry
canonical form: Tabasco
sense: 07842067-n
part of speech: noun
sense: 08763520-n

Tabasco sauce-n
type: LexicalEntry
canonical form: Tabasco sauce
sense: 07842067-n
part of speech: noun

07842067-n
type: LexicalConcept
in scheme: en-word.net
definition: very spicy sauce (trade name Tabasco) made from fully-aged red peppers
ili: i78266
lexfile: noun.food
part of speech: noun
hypernym: 07846569-n
mero substance: 07737797-n

08763520-n
type: LexicalConcept
in scheme: en-word.net
definition: a Mexican state on the Gulf of Campeche
ili: i82846
lexfile: noun.location
part of speech: noun
instance hypernym: 08671935-n