Wise-n
type: LexicalEntry
canonical form: Wise
sense: 11413310-n
part of speech: noun

Stephen Samuel Wise-n
type: LexicalEntry
canonical form: Stephen Samuel Wise
sense: 11413310-n
part of speech: noun

11413310-n
type: LexicalConcept
in scheme: en-word.net
definition: United States Jewish leader (born in Hungary) (1874-1949)
ili: i97458
lexfile: noun.person
part of speech: noun
instance hypernym: 10539087-n