Eritrea-n
type: LexicalEntry
canonical form: Eritrea
sense: 08795396-n
part of speech: noun

State of Eritrea-n
type: LexicalEntry
canonical form: State of Eritrea
sense: 08795396-n
part of speech: noun

08795396-n
type: LexicalConcept
in scheme: en-word.net
definition: an African country to the north of Ethiopia on the Red Sea; achieved independence from Ethiopia in 1993
ili: i83002
lexfile: noun.location
part of speech: noun
instance hypernym: 08716193-n
mero member: 09725180-n
mero part: 08795667-n
mero part: 08795771-n