St. Augustine-n
type: LexicalEntry
canonical form: St. Augustine
sense: 09097339-n
part of speech: noun
sense: 10848177-n

Saint Augustine-n
type: LexicalEntry
canonical form: Saint Augustine
sense: 09097339-n
part of speech: noun
sense: 10848177-n

09097339-n
type: LexicalConcept
in scheme: en-word.net
definition: a resort city in northeastern Florida; the oldest city in the United States
ili: i84308
lexfile: noun.location
part of speech: noun
instance hypernym: 08542298-n

Augustine-n
type: LexicalEntry
canonical form: Augustine
sense: 10848177-n
part of speech: noun

Augustine of Hippo-n
type: LexicalEntry
canonical form: Augustine of Hippo
sense: 10848177-n
part of speech: noun

10848177-n
type: LexicalConcept
in scheme: en-word.net
definition:
  value: (Roman Catholic Church) one of the great Fathers of the early Christian church; after a dramatic conversion to Christianity he became bishop of Hippo Regius in North Africa; St. Augustine emphasized man's need for grace (354-430)
ili: i94352
lexfile: noun.person
part of speech: noun
domain topic: 08100476-n
instance hypernym: 10725264-n
instance hypernym: 09941250-n
instance hypernym: 10566702-n
instance hypernym: 10041836-n