Battle of Spotsylvania Court House-n
type: LexicalEntry
canonical form: Battle of Spotsylvania Court House
sense: 01298409-n
part of speech: noun

Spotsylvania-n
type: LexicalEntry
canonical form: Spotsylvania
sense: 01298409-n
part of speech: noun
sense: 09175156-n

battle of Spotsylvania Courthouse-n
type: LexicalEntry
canonical form: battle of Spotsylvania Courthouse
sense: 01298409-n
part of speech: noun

01298409-n
type: LexicalConcept
in scheme: en-word.net
definition: a battle between the armies of Grant and Lee during the Wilderness Campaign
ili: i42179
lexfile: noun.act
part of speech: noun
domain region: 09171719-n
instance hypernym: 00958596-n

Spotsylvania County-n
type: LexicalEntry
canonical form: Spotsylvania County
sense: 09175156-n
part of speech: noun

09175156-n
type: LexicalConcept
in scheme: en-word.net
definition: a county in northeastern Virginia where battles were fought during the American Civil War
ili: i84733
lexfile: noun.location
part of speech: noun
instance hypernym: 08564445-n