Zephaniah-n
type: LexicalEntry
canonical form: Zephaniah
sense: 06452333-n
part of speech: noun
sense: 11426019-n

Sophonias-n
type: LexicalEntry
canonical form: Sophonias
sense: 06452333-n
part of speech: noun
sense: 11426019-n

Book of Zephaniah-n
type: LexicalEntry
canonical form: Book of Zephaniah
sense: 06452333-n
part of speech: noun

06452333-n
type: LexicalConcept
in scheme: en-word.net
definition: an Old Testament book telling the prophecies of Zephaniah which are concerned mainly with the approaching judgment by God upon the sinners of Judah
ili: i70331
lexfile: noun.communication
part of speech: noun
instance hypernym: 06406508-n

11426019-n
type: LexicalConcept
in scheme: en-word.net
definition: a Hebrew minor prophet of the late 7th century BC
ili: i97533
lexfile: noun.person
part of speech: noun
instance hypernym: 10503475-n