Scilly Islands-n
type: LexicalEntry
canonical form: Scilly Islands
sense: 08907690-n
part of speech: noun

Isles of Scilly-n
type: LexicalEntry
canonical form: Isles of Scilly
sense: 08907690-n
part of speech: noun

08907690-n
type: LexicalConcept
in scheme: en-word.net
definition: an archipelago of small islands off the southwestern coast of England near the entrance to the English Channel; formerly a haven for smugglers and pirates
ili: i83458
lexfile: noun.location
part of speech: noun
instance hypernym: 09226715-n