Savannah-n
type: LexicalEntry
canonical form: Savannah
sense: 09100332-n
part of speech: noun
sense: 09447743-n

09100332-n
type: LexicalConcept
in scheme: en-word.net
definition: a port in eastern Georgia near the mouth of the Savannah river
ili: i84324
lexfile: noun.location
part of speech: noun
instance hypernym: 08542298-n
instance hypernym: 08651532-n

Savannah River-n
type: LexicalEntry
canonical form: Savannah River
sense: 09447743-n
part of speech: noun

09447743-n
type: LexicalConcept
in scheme: en-word.net
definition: a river in South Carolina that flows southeast to the Atlantic
ili: i86132
lexfile: noun.object
part of speech: noun
instance hypernym: 09434308-n