San Juan-n
type: LexicalEntry
canonical form: San Juan
sense: 08771127-n
part of speech: noun

08771127-n
type: LexicalConcept
in scheme: en-word.net
definition: the capital and largest city of Puerto Rico
ili: i82885
lexfile: noun.location
part of speech: noun
instance hypernym: 08542298-n