San Fernando Valley-n
type: LexicalEntry
canonical form: San Fernando Valley
sense: 09445172-n
part of speech: noun

09445172-n
type: LexicalConcept
in scheme: en-word.net
definition: a fertile valley in southern California to the north of Los Angeles; includes many residential communities
ili: i86118
lexfile: noun.object
part of speech: noun
instance hypernym: 09491734-n