San Salvador-n
type: LexicalEntry
canonical form: San Salvador
sense: 08756364-n
part of speech: noun

Salvadoran capital-n
type: LexicalEntry
canonical form: Salvadoran capital
sense: 08756364-n
part of speech: noun

08756364-n
type: LexicalConcept
in scheme: en-word.net
definition: the capital and largest city of El Salvador; has suffered from recurrent earthquakes
ili: i82808
lexfile: noun.location
part of speech: noun
instance hypernym: 08709407-n