Saint Lucia-n
type: LexicalEntry
canonical form: Saint Lucia
sense: 09010823-n
part of speech: noun
sense: 09010979-n

St. Lucia-n
type: LexicalEntry
canonical form: St. Lucia
sense: 09010823-n
part of speech: noun
sense: 09010979-n

09010823-n
type: LexicalConcept
in scheme: en-word.net
definition: a volcanic island in the Windward Isles to the south of Martinique
ili: i83922
lexfile: noun.location
part of speech: noun
instance hypernym: 09339360-n

09010979-n
type: LexicalConcept
in scheme: en-word.net
definition: a country on the island of Saint Lucia; gained independence from Great Britain in 1979
ili: i83923
lexfile: noun.location
part of speech: noun
instance hypernym: 08562388-n
mero part: 09010823-n
mero part: 09011231-n